{"text_format":"1","workbook":"xlsx","n_sheets":5,"sheets":["Introduction ","Self-assessment","Rating","Drop Down 1","Drop Down 2"],"not_rendered":{"charts":0,"images":3,"macros":1,"external_links":0,"defined_names":10,"comments":0,"pivot_tables":0},"unopened":[],"bounds":{"document_bytes":16777216,"sheet_cells":100000,"rows_first":2000,"rows_last":500,"rows_between":2000,"halvings":0,"cell_chars":16384,"cell_head_chars":4096},"cells_cut":0,"cells_raw":0,"read":"whole","date_system":"1900"}

{"sheet":"Introduction ","index":0,"n_rows":18,"n_cols":4,"rows_kept":18,"cut":false,"hidden":false,"merged":[[9,2,9,3],[2,1,2,3],[5,1,5,3],[7,2,7,3],[17,2,17,3]]}
[]
[]
[null,"Audit committee best practices self-assessment"]
[]
[null,"We invite you to review your audit committee's current practices to determine whether they meet the best practices identified by our Deloitte specialists."]
[null,"You may click on the sections below to be redirected to that part of the self-assessment."]
[]
[null,"1-","Organization profile"]
[]
[null,"2-","Responsibilities and mandate"]
[null,null,"A","Financial reporting"]
[null,null,"B","Risk management "]
[null,null,"C","Compliance with laws and regulations"]
[null,null,"D","Relationship with independent auditor"]
[null,null,"E","Relationship with internal auditor"]
[null,null,"F","Internal control environment"]
[]
[null,"3- ","Composition of the audit committee"]

{"sheet":"Self-assessment","index":1,"n_rows":474,"n_cols":9,"rows_kept":474,"cut":false,"hidden":false,"merged":[[468,1,471,2],[431,2,432,2],[432,3,432,4],[463,2,464,2],[464,3,464,4],[292,2,293,2],[293,3,293,4],[295,2,296,2],[296,3,296,4],[298,2,299,2],[299,3,299,4],[309,2,310,2],[310,3,310,4],[417,2,418,2],[418,3,418,4],[303,1,303,4],[305,3,305,4],[307,3,307,4],[233,2,234,2],[234,3,234,4],[254,2,255,2],[255,3,255,4],[275,2,276,2],[276,3,276,4],[278,2,279,2],[279,3,279,4],[285,2,286,2],[286,3,286,4],[273,3,273,4],[173,3,173,4],[171,2,171,4],[175,3,175,4],[177,3,177,4],[179,3,179,4],[181,3,181,4],[425,2,425,4],[211,2,211,4],[213,3,213,4],[215,3,215,4],[217,3,217,4],[219,3,219,4],[195,3,195,4],[197,3,197,4],[199,3,199,4],[201,3,201,4],[203,1,203,4],[231,3,231,4],[236,1,236,4],[238,2,238,4],[246,1,246,4],[183,1,183,4],[187,3,187,4],[189,3,189,4],[191,3,191,4],[193,3,193,4],[153,1,153,4],[157,3,157,4],[159,3,159,4],[161,3,161,4],[2,1,2,2],[4,1,4,3],[101,3,101,4],[99,3,99,4],[97,3,97,4],[163,3,163,4],[165,3,165,4],[167,3,167,4],[169,3,169,4],[51,3,51,4],[91,3,91,4],[56,2,57,2],[87,3,87,4],[85,3,85,4],[8,3,8,4],[18,3,18,4],[20,3,20,4],[10,3,10,4],[6,1,6,3],[14,3,14,4],[12,3,12,4],[16,3,16,4],[22,3,22,4],[49,3,49,4],[57,3,57,4],[77,1,77,4],[81,3,81,4],[83,3,83,4],[145,3,145,4],[147,3,147,4],[149,3,149,4],[151,3,151,4],[89,3,89,4],[93,3,93,4],[95,3,95,4],[53,2,54,2],[54,3,54,4],[221,3,221,4],[223,3,223,4],[225,3,225,4],[227,3,227,4],[229,3,229,4],[263,3,263,4],[265,3,265,4],[267,3,267,4],[271,3,271,4],[250,3,250,4],[252,3,252,4],[257,3,257,4],[259,3,259,4],[288,3,288,4],[290,3,290,4],[281,3,281,4],[283,3,283,4],[444,3,444,4],[47,1,47,4],[79,2,79,4],[103,2,103,4],[131,2,131,4],[155,2,155,4],[185,2,185,4],[205,2,205,4],[377,2,377,4],[387,2,387,4],[398,3,398,4],[409,2,409,4],[400,2,400,4],[312,3,312,4],[314,2,314,4],[325,3,325,4],[339,3,339,4],[364,2,364,4],[341,2,341,4],[301,3,301,4]]}
[null,null,null,null,null,null,null,"Filter","Blank?"]
[null,null,null,null,null,null,null,"Display"]
[null,{"$f":"'Introduction '!B3","v":"Audit committee best practices self-assessment"},null,null,null,null,null,"Display"]
[null,null,null,null,null,null,null,"Display"]
[null,"Please read each question carefully and provide the appropriate response.",null,null,null,null,null,"Display"]
[null,null,null,null,null,null,null,"Display"]
[null,"1 - Organization profile",null,null,null,null,null,"Display"]
[null,null,null,null,null,null,null,"Display"]
[null,"1)","Which of the following industry sectors best describes the organization?",null,null,null,null,"Display"]
[null,null,null,null,null,null,null,"Display"]
[null,null,"Please specify:",null,null,null,null,{"$f":"IF(D9=\"Other:\",\"Display\",\"Hide\")","v":"Hide"}]
[null,null,null,null,null,null,null,{"$f":"H11","v":"Hide"}]
[null,"2)","Is the organization a public company?",null,null,null,null,"Display"]
[null,null,null,null,null,null,null,"Display"]
[null,"3)","On what stock exchange(s) does the company trade?",null,null,null,null,{"$f":"IF(D13=\"Yes\",\"Display\",\"Hide\")","v":"Hide"}]
[null,null,null,null,null,null,null,{"$f":"H15","v":"Hide"}]
[null,null,"Please specify: ",null,null,null,null,{"$f":"H16","v":"Hide"}]
[null,null,null,null,null,null,null,{"$f":"H17","v":"Hide"}]
[null,"4)","Market capitalization ",null,null,null,null,{"$f":"IF(D13=\"Yes\",\"Display\",\"Hide\")","v":"Hide"}]
[null,null,null,null,null,null,null,"Display"]
[null,"5)","What was the organization’s total revenue volume worldwide last fiscal year?",null,null,null,null,"Display"]
[null,null,null,null,null,null,null,"Display"]
[null,"6)","What is the number of employees in the organization worldwide?",null,null,null,null,"Display"]
[null,null,null,null,null,null,null,"Display"]
[null,"7)","In what countries or regions of the world does the organization operate? (Select all that apply) ",null,null,null,null,"Display"]
[null,null,null,null,null,null,null,"Display"]
[null,null,"Canada",null,null,null,null,"Display"]
[null,null,"USA",null,null,null,null,"Display"]
[null,null,"Africa",null,null,null,null,"Display"]
[null,null,"Australia",null,null,null,null,"Display"]
[null,null,"Central America",null,null,null,null,"Display"]
[null,null,"Central Europe",null,null,null,null,"Display"]
[null,null,"China",null,null,null,null,"Display"]
[null,null,"India",null,null,null,null,"Display"]
[null,null,"Indonesia",null,null,null,null,"Display"]
[null,null,"Japan",null,null,null,null,"Display"]
[null,null,"Mexico",null,null,null,null,"Display"]
[null,null,"Middle East",null,null,null,null,"Display"]
[null,null,"North Korea",null,null,null,null,"Display"]
[null,null,"Northern Europe",null,null,null,null,"Display"]
[null,null,"Russia",null,null,null,null,"Display"]
[null,null,"South America",null,null,null,null,"Display"]
[null,null,"Southeast Asia",null,null,null,null,"Display"]
[null,null,"Other, please specify below:",null,null,null,null,"Display"]
[null,null,null,null,null,null,null,"Display"]
[null,null,null,null,null,null,null,"Display"]
[null,null,null,null,null,null,null,"Display"]
[null,"2- Responsibilities and mandate",null,null,null,null,null,"Display"]
[null,null,null,null,null,null,null,"Display"]
[null,"8)","Who has the responsibility for the oversight of the preparation and issuance of the financial statements?",null,null,null,null,"Display"]
[null,null,null,null,null,null,null,"Display"]
[null,null,null,null,null,null,null,{"$f":"IF(D50=\"Other, please specify:\",\"Display\",\"Hide\")","v":"Hide"}]
[null,null,null,null,null,null,null,{"$f":"H52","v":"Hide"}]
[null,"9)","Does the organization have a formal written mandate for those with the responsibility of overseeing the preparation and issuance of the financial statements?",null,null,null,null,"Display"]
[null,null,null,null,null,null,null,"Display"]
[null,null,null,null,null,null,null,"Display"]
[null,"10)","Does the organization have a written code of business conduct and ethics that includes standards for ethical decision-making and compliance, and which one addresses potentially challenging situations that may arise during the normal course of business?",null,null,null,null,"Display"]
[null,null,null,null,null,null,null,"Display"]
[null,null,null,null,null,null,null,"Display"]
[null,"11)","Over the past year, what additional responsibilities has the audit committee assumed? (Select all that apply.)",null,null,null,null,"Display"]
[null,null,null,null,null,null,null,"Display"]
[null,null,"Financial Information Review (F/S, MD&A, annual and interim results press releases, etc.)",null,null,null,null,"Display"]
[null,null,"Selection of Critical Accounting Policies",null,null,null,null,"Display"]
[null,null,"Compliance with Laws and Regulations",null,null,null,null,"Display"]
[null,null,"Approval of Significant Transactions including Financing, Acquisitions, Divestures, Related Party Transactions",null,null,null,null,"Display"]
[null,null,"Relationship with independent auditor",null,null,null,null,"Display"]
[null,null,"Relationship with Internal Auditor",null,null,null,null,"Display"]
[null,null,"Assessment of Internal Controls and Investigation of Control Deviations",null,null,null,null,"Display"]
[null,null,"Special Investigations",null,null,null,null,"Display"]
[null,null,"Oversight of cybersecurity risks",null,null,null,null,"Display"]
[null,null,"Communications with regulators",null,null,null,null,"Display"]
[null,null,"Review of Information on the corporate website",null,null,null,null,"Display"]
[null,null,"Review of the pandemic response and recovery plan",null,null,null,null,"Display"]
[null,null,"Other, please specify:",null,null,null,null,"Display"]
[null,null,null,null,null,null,null,"Display"]
[null,null,null,null,null,null,null,"Display"]
[null,null,null,null,null,null,null,"Display"]
[null,"2A. Financial reporting (includes review of financial information, selection of critical accounting policies and approval of transactions involving financing, acquisitions, divestitures, and related parties) ",null,null,null,null,null,"Display"]
[null,null,null,null,null,null,null,"Display"]
[null,"12)","In the past year, which of the following information did the audit committee typically review as part of its responsibilities with respect to financial information and recommend for approval to the board? (For each, please indicate whether it was reviewed before issuance to the public, after issuance to the public, not reviewed, or don’t know).",null,null,null,null,"Display"]
{"$rows_left_out":395}
{"sheet":"Rating","index":2,"n_rows":16,"n_cols":8,"rows_kept":16,"cut":false,"hidden":true,"merged":[]}
["Item","Question 12","Question 15","Question 16","Question 17","Question 18","Question 20","Questions 23 to 28"]
["Total Number of Questions",11,4,7,5,8,10,13]
[]
["Not covered",{"$f":"COUNTIF('Self-assessment'!D82:D102,\"Not reviewed\")","v":0},null,null,null,{"$f":"COUNTIF('Self-assessment'!D188:E202,\"Never\")","v":0}]
[]
["Blanks",{"$f":"SUM('Self-assessment'!I82:I102)","v":11},{"$f":"SUM('Self-assessment'!I146:I152)","v":4},{"$f":"SUM('Self-assessment'!I158:I170)","v":7},{"$f":"SUM('Self-assessment'!I174:I182)","v":5},{"$f":"SUM('Self-assessment'!I188:I202)","v":8},{"$f":"SUM('Self-assessment'!I214:I232)","v":10},{"$f":"SUM('Self-assessment'!I251:I282)","v":13}]
[]
["Covered",{"$f":"B2-(B4+B6)","v":0},{"$f":"COUNTIF('Self-assessment'!D146:D152,\"Agree\")","v":0},{"$f":"COUNTIF('Self-assessment'!D158:D170,\"Agree\")","v":0},{"$f":"COUNTIF('Self-assessment'!D174:E182,\"Agree\")","v":0},{"$f":"F2-(F4+F6)","v":0},{"$f":"COUNTIF('Self-assessment'!D214:D232,\"Agree\")","v":0},{"$f":"COUNTIF('Self-assessment'!D251:D282,\"Yes\")","v":0}]
[]
["Percentage covered",{"$f":"B8/B2","v":0},0,0,0,0,0,0]
[]
["Acceptable?",{"$f":"IF(B10>$B$16,\"Yes\",\"No\")","v":"No"},"No","No","No","No","No","No"]
[]
[]
[]
["Passing rate",0.6]

{"sheet":"Drop Down 1","index":3,"n_rows":23,"n_cols":14,"rows_kept":23,"cut":false,"hidden":true,"merged":[]}
["Industry Sectors","Stock Exchange","Market Capitalization","Revenue Volume","Number of Employees","Countries","Oversight Responsibility","Responsibilities Assumed by Audit Committee","Information Reviewed by Audit Committee & Recommended for Approval","Information Audit Committee Discussed/Reviewed with Management & External Auditors","Information Discussed with Management & External Auditors to Understand Preferences","Risk Management Activities","Relationship Between Audit Committee & External Auditors","Relationship Between Audit Committee & Internal Auditors"]
["Banking","TSX & TSX-V","Under $10 million","Under $1 million","Under 100","Canada","Audit Committee","Financial Information Review (F/S, MD&A, annual and interim results press releases, etc.)","Annual financial statements","The impact of changes in accounting policies","Critical accounting policies","Assessment of the risk of material misstatement","Management dominated the relationship ","Management dominated the relationship"]
["Consumer Business","CDNX","$10 - $49 million","$1 - $9 milllion","100 - 499","USA","Board of Directors","Selection of Critical Accounting Policies","Annual financial statements of subsidiaries","The selection of critical accounting principles","Key estimates and judgements","Identification of the major risk areas","The audit committee has assumed the primary reporting relationship for the external function ","The audit committee has assumed an oversight role with respect to the relationship"]
["Education","NASDAQ","$50 -$99 million","$10 - $49 million","500 - 999","Africa","Other, please specify:","Compliance with Laws and Regulations","Related pension fund financial statements","The quality, not just the acceptability, of financial accounting and reporting","Clarity and completeness of the company's financial disclosures","Management's response to the identified risks","The audit committee has assumed an oversight role in partnership with management as regards to the relationship with the external auditor","The audit committee has assumed the primary reporting relationship for the internal audit function"]
["Energy/Utilities","NYSE","$100 - $249 million","$50 - $99 millon","1,000 - 2,499","Australia",null,"Approval of Significant Transactions Including Financing, Acquisitions, Divestures, Related Party Transactions","MD&A","Accounting estimates and key areas where management judgement was applied to arrive at the financial reporting","Degree of aggressiveness or conservatism of accounting policies",null,null,"Not Applicable"]
["Government","Other:","$250 - $499 million","$100 - $149 million","2,500 - 4,999","Central America",null,"Divestures, Related Party Transactions","Annual report","The clarity and completeness of the company's disclosure","Other, please specify:",null,null,"Don't Know"]
["Health Care",null,"$500 - $999 million","$150 - $249 million","2,500 - 4,999","Central Europe",null,"Relationship with External Auditor","Annual Information Form","The process used by management to identify related parties"]
["High Technology",null,"$1 - $10 billion","$250 - $499 million","5000 - 9,999","China",null,"Relationship with Internal Auditor","Interim financial information","The transparency of related party disclosures"]
["Insurance",null,"Over $10 billion","$500 - $999 million","10,000 - 14,999","India",null,"Assessment of Internal Controls and Investigation of Control Deviations","Press releases that include financial information","All unrecorded audit adjustments"]
["Investment Management Services",null,null,"$1 - $10 billion","15,000 - 25,000","Indonesia",null,"Special Investigations",null,"The independence of the external auditor"]
["Manufacturing",null,null,"Over $10 billion","Over 25,000","Japan",null,"Communications with Regulators",null,"The nature and extent of non-audit services provided by the external auditor and the related disclosures"]
["Media and Entertainment",null,null,null,null,"Mexico",null,"Review of Information on the Corporate Website",null,"The nature, extent and scope of the audit plan before the audit begins"]
["Not-for-Profit",null,null,null,null,"Middle East",null,"Other, please specify:",null,"The business risks and the quality of the system of internal controls"]
["Professional Services",null,null,null,null,"North Korea",null,null,null,"The extent to which the system of internal controls is reviewed"]
["Real Estate",null,null,null,null,"Northern Europe",null,null,null,"The occurrence of illegal acts, fraud or other irregularities"]
["Resources",null,null,null,null,"Russia",null,null,null,"The occurrence of any disagreements bewteen management, the external and internal auditors"]
["Social Services",null,null,null,null,"South America",null,null,null,"The use of consultations with other auditors"]
["Telecommunications",null,null,null,null,"Southeast Asia",null,null,null,"The use of other specialists (e.g. actuaries, lawyers)"]
["Trade",null,null,null,null,"Other:",null,null,null,"Any difficulties encountered in completing the audit"]
["Transportation",null,null,null,null,null,null,null,null,"The consultations with National Office"]
["Cannabis",null,null,null,null,null,null,null,null,"Hiring policies regarding the issuer's partners, employees and former partners, and the external auditors employees"]
["Other:",null,null,null,null,null,null,null,null,"The procedure for the receipt, retention and treatment of complaints"]
[null,null,null,null,null,null,null,null,null,"Other, please specify:"]

{"sheet":"Drop Down 2","index":4,"n_rows":35,"n_cols":23,"rows_kept":35,"cut":false,"hidden":true,"merged":[]}
["Number of people","Audit committee member selection criteria","Audit committee meeting frequency","Factors influencing  audit committee's priorities ",{"$f":"E1:J24Recording of minutes frequency","v":{"$error":"#NAME?"}},"Information types used by audit committee","Reports/communications from external auditor that were used","Reports/communications from internal auditor that were used","Reports/communications from management that were used","Who the audit committee reports to ","Reporting of public information regarding:","Does the board chair:","Audit committee's assessment of performance","Audit committee's style","Agendas","Interactions between committee members","Audit committee chairperson characteristics"]
["Less than three people","Independence (non-management)","Once","Tradition","All the time","Annual consolidated financial statements","The planning of the annual audit","Their plan for the year","Risk management processes and issues","To the Board of Directors on their review of annual financial statements?","Charter?","Ensure coordination of work between board committees?","By reviewing its practices only after a problem or failure occurs?","Formal","The agendas are tightly controlled?","Limited interaction?","Dominate the committee?"]
["Three people","Unrelated (to the company)","Twice","External reporting requirements and timetable ","Occasionally","Annual financial statements for each subsidiary ","The results of the annual audit","The results of their work","Assessment of the company's business risks","Informally to the Board of Directors on other matters?","Membership?","Meet with all committee chairpersons to ensure there is effective working relationships and coordination of activities?","By using an informal assessment undertaken within the committee (or as part of broader board self-assessment?)","Focused on achieving conformity and consensus ","The agendas are controlled but with opportunity for input from members?","Time to ask questions and discuss issues?","Provide leadership?"]
["Four people","Interest in serving on the audit committee","Three ","Internal mandate","For selected meetings","Annual financial statements for each investee subject to significant influence","Past adjustments to the financial statements","Management's response to previously noted internal control concerns","The company's strategic plan","Regularly to the Chairman of the Board and the full Board?","Mandates?",null,"By using a formal assessment undertaken within the committee (or as part of a broader board self-assesment)?","Informal, but efficient and businesslike","Members are encouraged to ask questions and scrutinize issues?",null,"Allow dissenting opinions ample opportunity for review and discussion? "]
["Five people","Business and financial skills ","Quarterly ","The Chair of the audit committee proposes the agenda in consultaion with management and the external/internal auditors and seeks input from members","Never","Annual financial statements for the company pension fund","Their independence ","The related party transactiond details","Management compensation information","Other, please specify:","Performance?",null,null,"Members behave as part of a tight working group"]
["Six or more people","Don't know","More than four ","Uses a formal process established for setting priorities based on assessment of risks","Don't know ","Quarterly consolidated financial statements","Their quarterly review work, if any ","Other, please specify: ","The regulator's reviews",null,null,null,null,"Other, please specify:"]
["Don't know","Other, please specify:","Don't know ","Don't know",null,"Quarterly financial statements for each subsidiary ","Internal controls work, if any ",null,"Other, please specify:"]
[null,null,null,"Other, please specify:",null,"Quarterly financial statements for each investee subject to significant influence ","Special audit reviews"]
[null,null,null,null,null,"MD&A","Other, please specify:"]
[null,null,null,null,null,"Annual report"]
[null,null,null,null,null,"Annual information form"]
[null,null,null,null,null,"Draft press releases"]
[null,null,null,null,null,"Final press releases"]
[null,null,null,null,null,"Full public offerings documents or registration statements prospectus"]
[null,null,null,null,null,"Monthly or quarterly financial variance analyses with explanations describing period and year-to-date actual performance against plan "]
[null,null,null,null,null,"Monthly or quarterly financial variance analyses with explanations describing period and year-to-date actual performance against forecasts "]
["Annual financial statements",null,null,null,null,"Monthly or quarterly financial analysis information by business segment on a comparative basis"]
["Reviewed before issuance to the public",null,"Yes","Yes",null,"Sufficient information related to important accounting and financial reporting issues"]
["Reviewed after issuance to the public",null,"No","No",null,"Other, please specify:",null,null,null,null,null,null,null,null,null,null,null,null,null,null,null,null,{"$f":"IF(L17='Drop Down 2'!B7,\"Display\",\"Hide\")","v":"Hide"}]
["Not reviewed",null,"Don't know"]
["Don’t know"]
[]
[]
[]
["Agree","More than enough"]
["Disagree","About right"]
["Don't Know","Insufficient"]
[]
[]
[]
["Never"]
["Only when issues arise"]
["Annually"]
["Don't Know"]
["N/A"]